{"text_format":"1","workbook":"xlsx","n_sheets":9,"sheets":["Notes","Totals","Detail","Personnel","Crew","Comparison","Schedule","Assumptions","Parameters"],"not_rendered":{"charts":0,"images":1,"macros":1,"external_links":1,"defined_names":55,"comments":0,"pivot_tables":0},"unopened":[],"bounds":{"document_bytes":16777216,"sheet_cells":100000,"rows_first":2000,"rows_last":500,"rows_between":2000,"halvings":0,"cell_chars":16384,"cell_head_chars":4096},"cells_cut":0,"cells_raw":0,"read":"whole","date_system":"1900"}

{"sheet":"Notes","index":0,"n_rows":6,"n_cols":1,"rows_kept":6,"cut":false,"hidden":false,"merged":[]}
["Notes for using this template"]
[]
["If you get a #NAME error under the holiday calculation in the Personnel Sheet please follow these steps:"]
["      Tools > Add-Ins > Tick the box next to Analysis ToolPak"]
[]
["If you need to unprotect any sheet, select Tools > Protection > Unprotect"]

{"sheet":"Totals","index":1,"n_rows":73,"n_cols":13,"rows_kept":73,"cut":false,"hidden":false,"merged":[[23,8,23,9],[24,8,24,9],[2,4,2,7],[3,4,3,7],[4,4,4,7],[7,4,7,5],[41,8,41,9],[32,8,32,9],[33,8,33,9],[25,8,25,9],[26,8,26,9],[27,8,27,9],[28,8,28,9],[29,8,29,9],[30,8,30,9],[31,8,31,9],[36,8,36,9],[37,8,37,9],[38,8,38,9],[39,8,39,9],[40,8,40,9],[48,8,48,9],[15,8,15,9],[17,8,17,9],[18,8,18,9],[19,8,19,9],[20,8,20,9],[21,8,21,9],[22,8,22,9],[42,8,42,9],[43,8,43,9],[46,8,46,9],[47,8,47,9],[44,8,44,9],[45,8,45,9],[34,8,34,9],[35,8,35,9]]}
[]
[null,null,null,null,null,null,null,null,null,null,null,null,"Detail Page"]
[null,null,null,null,"ITV STUDIOS",null,null,null,null,null,null,null,"Personnel"]
[null,null,null,null,"FACTUAL / ENTERTAINMENT",null,null,null,null,null,null,null,"Crew"]
[null,null,null,null,"Programme Budget",null,null,null,null,null,null,null,"Comparison"]
[null,null,null,null,null,null,null,null,null,null,null,null,"Schedule"]
[null,null,null,null,null,null,null,null,null,null,null,null,"Assumptions"]
[null,null,null,"Programme Name:",null,null,null,{"$f":"TODAY()","v":"2014-02-11"}]
[null,null,null,"Programme Number:"]
[null,null,null,"Episodes in series:",null," ",null,"Broadcaster"]
[null,null,null,"Episode Length:",null,null,null,"Tape Delivery"]
[null,null,null,"Version:",null,null,null,"Currency"]
[null,null,null,"No. of Transmissions:"]
[]
[]
[null,null,null,"Categories",null,"Episode","Series",null,"Notes"]
[null,null,null,null,null,{"$f":"IF(I12=\"EUR\",\"€\",IF(OR(I12=\"AUD\",I12=\"USD\"),\"$\",\"£\"))","v":"£"},{"$f":"IF(I12=\"EUR\",\"€\",IF(OR(I12=\"AUD\",I12=\"USD\"),\"$\",\"£\"))","v":"£"}]
[null,null,"01","Scripts/ Formats/Development",null,{"$f":"IF(ISERROR(ROUND(G18/Eps,2)),0,(ROUND(G18/Eps,2)))","v":0},{"$f":"VLOOKUP(C18&\"Sub-Total\",Detail!$B:$I,8,0)","v":0}]
[null,null,"02","Producer/Director",null,0,{"$f":"VLOOKUP(C19&\"Sub-Total\",Detail!$B:$I,8,0)","v":0}]
[null,null,"03","Artists",null,0,{"$f":"VLOOKUP(C20&\"Sub-Total\",Detail!$B:$I,8,0)","v":0}]
{"$rows_left_out":54}
{"sheet":"Detail","index":2,"n_rows":546,"n_cols":11,"rows_kept":546,"cut":false,"hidden":false,"merged":[[378,3,378,4],[300,3,300,4],[19,3,19,4],[28,3,28,4],[52,3,52,4],[66,3,66,4],[333,3,333,4],[325,3,325,4],[201,3,201,4],[220,3,220,4],[234,3,234,4],[263,3,263,4],[75,3,75,4],[87,3,87,4],[104,3,104,4],[115,3,115,4],[348,3,348,4],[128,3,128,4],[156,3,156,4],[173,3,173,4],[184,3,184,4],[274,3,274,4],[389,3,389,4],[401,3,401,4],[419,3,419,4],[453,3,453,4],[478,3,478,4],[543,8,544,8],[503,3,503,4],[515,3,515,4],[528,3,528,4],[535,3,535,4],[541,3,541,4],[543,1,544,6],[543,7,544,7]]}
[null,"Back to Totals Page",null,{"$f":"Name","v":0}]
[null,null,null,{"$f":"Number","v":0}]
[null,null,null,"Budget Detail"]
[]
[null,"Code","Description","Information","Unit","Occ","Rate",{"$f":"\"Per Ep \"&Currency","v":"Per Ep £"},{"$f":"\"Series \"&Currency","v":"Series £"}]
[null,null,null,null,null,null,null,null,{"$f":"I20","v":0}]
[null,"01","Scripts/Formats/Development",null,null,null,null,{"$f":"IF(H20=0,0,\"Ep\")","v":0},{"$f":"IF(I20=0,0,\"Series\")","v":0}]
[null,null,null,null,null,null,null,null,0]
[null,"01A",{"$f":"VLOOKUP(LEFT(B9,3),Parameters!E:F,2,0)","v":"Writers Fees"},null,null,"Occ",0,{"$f":"IF(ISERROR(ROUND(I9/Eps,2)),0,ROUND(I9/Eps,2))","v":0},{"$f":"ROUND(E9*G9,2)","v":0}]
[null,"01B",{"$f":"VLOOKUP(LEFT(B10,3),Parameters!E:F,2,0)","v":"Writers Repeat Fees"},null,0,"Occ",0,0,{"$f":"ROUND(E10*G10,2)","v":0}]
[null,"01C",{"$f":"VLOOKUP(LEFT(B11,3),Parameters!E:F,2,0)","v":"Writers Pension"},null,0,"Occ",0,0,0]
[null,"01D",{"$f":"VLOOKUP(LEFT(B12,3),Parameters!E:F,2,0)","v":"Scripts Team"},null,0,"Occ",0,0,0]
[null,"01E",{"$f":"VLOOKUP(LEFT(B13,3),Parameters!E:F,2,0)","v":"Consultancy - Scripts"},null,0,"Occ",0,0,0]
[null,"01F",{"$f":"VLOOKUP(LEFT(B14,3),Parameters!E:F,2,0)","v":"Rights / Format Fees"},null,0,"Occ",0,0,0]
[null,"01G",{"$f":"VLOOKUP(LEFT(B15,3),Parameters!E:F,2,0)","v":"Uncommissioned Writers"},null,0,"Occ",0,0,0]
[null,"01H",{"$f":"VLOOKUP(LEFT(B16,3),Parameters!E:F,2,0)","v":"Options"},null,0,"Occ",0,0,0]
[null,"01I",{"$f":"VLOOKUP(LEFT(B17,3),Parameters!E:F,2,0)","v":"Development Costs"},null,0,"Occ",0,0,0]
[null,"01J",{"$f":"VLOOKUP(LEFT(B18,3),Parameters!E:F,2,0)","v":"Storyboards"},null,0,"Occ",0,0,0]
[null,"01K",{"$f":"VLOOKUP(LEFT(B19,3),Parameters!E:F,2,0)","v":"Create Advance Payment"},null,0,"Occ",0,0,0]
[null,{"$f":"B7&D20","v":"01Sub-Total"},null,"Sub-Total",null,null,null,{"$f":"SUM(H8:H19)","v":0},{"$f":"SUM(I8:I19)","v":0}]
{"$rows_left_out":527}
{"sheet":"Personnel","index":3,"n_rows":75,"n_cols":28,"rows_kept":75,"cut":false,"hidden":false,"merged":[[0,0,0,2],[2,0,2,1],[3,0,3,1],[7,0,7,1],[6,0,6,1],[29,25,30,25],[74,27,75,27],[74,16,75,16],[74,17,75,17],[74,19,75,19],[74,21,75,21],[74,23,75,23],[74,25,75,25],[29,27,30,27],[29,16,30,16],[29,23,30,23],[74,0,75,7],[74,11,75,11],[74,13,75,13],[29,21,30,21],[29,11,30,11],[29,13,30,13],[29,0,30,7],[29,17,30,17],[29,19,30,19]]}
["Personnel Breakdown",null,null,"Back to detail page"]
[]
["Prog Name:",null,{"$f":"Name","v":0}]
["Prog Number:",null,{"$f":"Number","v":0}]
["Eps:",null,{"$f":"Eps","v":0}]
[]
["Personnel Total:",null,{"$f":"AB30+AB75","v":0}]
["Personnel per ep:",null,{"$f":"IF(ISERROR(ROUND(C7/C5,2)),0,(ROUND(C7/C5,2)))","v":0}]
[]
["* Complete yellow cells *"]
[]
["Code","Full Code","Role","Name","Dates","Contract","Pension","Daily / Weekly / One Fee","Week No. From","Week\nNo. To","Weekly Rate","No. of Weeks","Daily Rate","No. of Days","One Fee",null,"Hol days inc bank hol","Hols to be taken (inc bank hol)",null,{"$f":"\"Basic - \"&Currency","v":"Basic - £"},null,{"$f":"\"NI - \"&Currency","v":"NI - £"},null,{"$f":"\"Pension - \"&Currency","v":"Pension - £"},null,{"$f":"\"Hol - \"&Currency","v":"Hol - £"},null,{"$f":"\"TOTAL COST  \"&Currency","v":"TOTAL COST  £"}]
["02","Producer/Director Salaries"]
[{"$f":"IF(ISERROR(VLOOKUP(C14,Parameters!$B:$C,2,0)),\"-\",VLOOKUP(C14,Parameters!$B:$C,2,0))","v":"-"},{"$f":"IF($A14=\"-\",\"-\",IF((COUNTIF($A14:$A$14,$A14)-1)<10,$A14&\"-0\"&(COUNTIF($A14:$A$14,$A14)-1),$A14&\"-\"&(COUNTIF($A14:$A$14,$A14)-1)))","v":"-"},null,null,null,null,null,null,null,null,null,{"$f":"IF(OR(I14=0,J14=0),0,IF(J14<I14,53-I14+J14,J14-I14+1))","v":0},null,null,null,null,{"$f":"MROUND(IF(AND(F14=\"Schedule D\",H14=\"Daily\"),(N14/5)*0.54,IF(AND(F14=\"PAYE\",H14=\"Daily\"),(N14/5)*0.63,IF(AND(F14=\"Schedule D\",H14=\"Weekly\"),L14*0.54,IF(AND(F14=\"PAYE\",H14=\"Weekly\"),L14*0.63,0)))),0.5)","v":0},0,null,{"$f":"ROUND(IF($H14=\"Weekly\",($L14*$K14),IF($H14=\"Daily\",($N14*$M14),$O14)),2)","v":0},null,{"$f":"IF(ISERROR(ROUND(IF(F14=\"PAYE\",(T14+Z14)*13.8%,0),2)),0,(ROUND(IF(F14=\"PAYE\",(T14+Z14)*13.8%,0),2)))","v":0},null,{"$f":"IF(ISERROR(ROUND($T14*$G14,2)),0,ROUND($T14*$G14,2))","v":0},null,{"$f":"IF(ISERROR(ROUND((IF($F14=\"Schedule D\",($T14*10.77%)/Q14*(Q14-R14),IF($F14=\"PAYE\",($T14*12.69%)/Q14*(Q14-R14),0))),2)),0,(ROUND((IF($F14=\"Schedule D\",($T14*10.77%)/Q14*(Q14-R14),IF($F14=\"PAYE\",($T14*12.69%)/Q14*(Q14-R14),0))),2)))","v":0},null,{"$f":"T14+V14+X14+Z14","v":0}]
[{"$f":"IF(ISERROR(VLOOKUP(C15,Parameters!$B:$C,2,0)),\"-\",VLOOKUP(C15,Parameters!$B:$C,2,0))","v":"-"},{"$f":"IF($A15=\"-\",\"-\",IF((COUNTIF($A$15:$A15,$A15)-1)<10,$A15&\"-0\"&(COUNTIF($A$15:$A15,$A15)-1),$A15&\"-\"&(COUNTIF($A$15:$A15,$A15)-1)))","v":"-"},null,null,null,null,null,null,null,null,null,{"$f":"IF(OR(I15=0,J15=0),0,IF(J15<I15,53-I15+J15,J15-I15+1))","v":0},null,null,null,null,0,0,null,{"$f":"ROUND(IF($H15=\"Weekly\",($L15*$K15),IF($H15=\"Daily\",($N15*$M15),$O15)),2)","v":0},null,{"$f":"IF(ISERROR(ROUND(IF(F15=\"PAYE\",(T15+Z15)*13.8%,0),2)),0,(ROUND(IF(F15=\"PAYE\",(T15+Z15)*13.8%,0),2)))","v":0},null,{"$f":"IF(ISERROR(ROUND($T15*$G15,2)),0,ROUND($T15*$G15,2))","v":0},null,{"$f":"IF(ISERROR(ROUND((IF($F15=\"Schedule D\",($T15*10.77%)/Q15*(Q15-R15),IF($F15=\"PAYE\",($T15*12.69%)/Q15*(Q15-R15),0))),2)),0,(ROUND((IF($F15=\"Schedule D\",($T15*10.77%)/Q15*(Q15-R15),IF($F15=\"PAYE\",($T15*12.69%)/Q15*(Q15-R15),0))),2)))","v":0},null,{"$f":"T15+V15+X15+Z15","v":0}]
[{"$f":"IF(ISERROR(VLOOKUP(C16,Parameters!$B:$C,2,0)),\"-\",VLOOKUP(C16,Parameters!$B:$C,2,0))","v":"-"},{"$f":"IF($A16=\"-\",\"-\",IF((COUNTIF($A$15:$A16,$A16)-1)<10,$A16&\"-0\"&(COUNTIF($A$15:$A16,$A16)-1),$A16&\"-\"&(COUNTIF($A$15:$A16,$A16)-1)))","v":"-"},null,null,null,null,null,null,null,null,null,{"$f":"IF(OR(I16=0,J16=0),0,IF(J16<I16,53-I16+J16,J16-I16+1))","v":0},null,null,null,null,0,0,null,0,null,{"$f":"IF(ISERROR(ROUND(IF(F16=\"PAYE\",(T16+Z16)*13.8%,0),2)),0,(ROUND(IF(F16=\"PAYE\",(T16+Z16)*13.8%,0),2)))","v":0},null,0,null,{"$f":"IF(ISERROR(ROUND((IF($F16=\"Schedule D\",($T16*10.77%)/Q16*(Q16-R16),IF($F16=\"PAYE\",($T16*12.69%)/Q16*(Q16-R16),0))),2)),0,(ROUND((IF($F16=\"Schedule D\",($T16*10.77%)/Q16*(Q16-R16),IF($F16=\"PAYE\",($T16*12.69%)/Q16*(Q16-R16),0))),2)))","v":0},null,{"$f":"T16+V16+X16+Z16","v":0}]
[{"$f":"IF(ISERROR(VLOOKUP(C17,Parameters!$B:$C,2,0)),\"-\",VLOOKUP(C17,Parameters!$B:$C,2,0))","v":"-"},{"$f":"IF($A17=\"-\",\"-\",IF((COUNTIF($A$15:$A17,$A17)-1)<10,$A17&\"-0\"&(COUNTIF($A$15:$A17,$A17)-1),$A17&\"-\"&(COUNTIF($A$15:$A17,$A17)-1)))","v":"-"},null,null,null,null,null,null,null,null,null,0,null,null,null,null,0,0,null,0,null,0,null,0,null,0,null,0]
[{"$f":"IF(ISERROR(VLOOKUP(C18,Parameters!$B:$C,2,0)),\"-\",VLOOKUP(C18,Parameters!$B:$C,2,0))","v":"-"},{"$f":"IF($A18=\"-\",\"-\",IF((COUNTIF($A$15:$A18,$A18)-1)<10,$A18&\"-0\"&(COUNTIF($A$15:$A18,$A18)-1),$A18&\"-\"&(COUNTIF($A$15:$A18,$A18)-1)))","v":"-"},null,null,null,null,null,null,null,null,null,0,null,null,null,null,0,0,null,0,null,0,null,0,null,0,null,0]
[{"$f":"IF(ISERROR(VLOOKUP(C19,Parameters!$B:$C,2,0)),\"-\",VLOOKUP(C19,Parameters!$B:$C,2,0))","v":"-"},{"$f":"IF($A19=\"-\",\"-\",IF((COUNTIF($A$15:$A19,$A19)-1)<10,$A19&\"-0\"&(COUNTIF($A$15:$A19,$A19)-1),$A19&\"-\"&(COUNTIF($A$15:$A19,$A19)-1)))","v":"-"},null,null,null,null,null,null,null,null,null,0,null,null,null,null,0,0,null,0,null,0,null,0,null,0,null,0]
[{"$f":"IF(ISERROR(VLOOKUP(C20,Parameters!$B:$C,2,0)),\"-\",VLOOKUP(C20,Parameters!$B:$C,2,0))","v":"-"},{"$f":"IF($A20=\"-\",\"-\",IF((COUNTIF($A$15:$A20,$A20)-1)<10,$A20&\"-0\"&(COUNTIF($A$15:$A20,$A20)-1),$A20&\"-\"&(COUNTIF($A$15:$A20,$A20)-1)))","v":"-"},null,null,null,null,null,null,null,null,null,0,null,null,null,null,0,0,null,0,null,0,null,0,null,0,null,0]
{"$rows_left_out":56}
{"sheet":"Crew","index":4,"n_rows":152,"n_cols":15,"rows_kept":152,"cut":false,"hidden":false,"merged":[[7,0,7,1],[19,9,20,9],[0,0,0,2],[2,0,2,1],[3,0,3,1],[6,0,6,1],[19,11,20,11],[19,13,20,13],[19,0,20,7],[38,0,39,7],[38,9,39,9],[38,11,39,11],[38,13,39,13],[51,0,52,7],[51,9,52,9],[51,11,52,11],[51,13,52,13],[66,0,67,7],[66,9,67,9],[66,11,67,11],[66,13,67,13],[96,0,97,7],[96,9,97,9],[96,11,97,11],[96,13,97,13],[115,0,116,7],[115,9,116,9],[115,11,116,11],[115,13,116,13],[128,0,129,7],[128,9,129,9],[128,11,129,11],[128,13,129,13],[147,0,148,7],[147,9,148,9],[147,11,148,11],[147,13,148,13]]}
["Crew Breakdown"]
["Back to Detail Page"]
["Prog Name:",null,{"$f":"Name","v":0}]
["Prog Number:",null,{"$f":"Number","v":0}]
["Eps:",null,{"$f":"Eps","v":0}]
[]
[{"$f":"\"Crew Tot (\"&Currency&\"):\"","v":"Crew Tot (£):"},null,{"$f":"SUM(N:N)/2","v":0}]
[{"$f":"\"Crew per ep (\"&Currency&\"):\"","v":"Crew per ep (£):"},null,{"$f":"IF(ISERROR(ROUND(C7/C5,2)),0,(ROUND(C7/C5,2)))","v":0}]
[]
[]
["Code","Full Code","Role","Name","Dates","No. Of Days","Daily Rate","Nat Ins @ 13.8%?",null,{"$f":"\"Basic - \"&Currency","v":"Basic - £"},null,{"$f":"\"NI - \"&Currency","v":"NI - £"},null,{"$f":"\"Total - \"&Currency","v":"Total - £"},"Filter"]
["06 -","ASSISTANT DIRECTORS/CONTINUITY",null,null,null,null,null,null,null,"Basic",null,{"$f":"L11","v":"NI - £"},null,{"$f":"N11","v":"Total - £"},{"$f":"IF(N20=0,0,1)","v":0}]
[{"$f":"IF(ISERROR(VLOOKUP(C13,Parameters!$F:$G,2,0)),\"-\",VLOOKUP(C13,Parameters!$F:$G,2,0))","v":"06A"},{"$f":"IF($A13=\"-\",\"-\",IF((COUNTIF($A$13:$A13,$A13)-1)<10,$A13&\"-0\"&(COUNTIF($A$13:$A13,$A13)-1),$A13&\"-\"&(COUNTIF($A$13:$A13,$A13)-1)))","v":"06A-00"},"1st Assistant Director",null,null,null,null,null,null,{"$f":"ROUND(F13*G13,2)","v":0},null,{"$f":"ROUND(IF(H13=\"Yes\",J13*13.8%,0),2)","v":0},null,{"$f":"J13+L13","v":0},{"$f":"IF(N13=0,0,1)","v":0}]
[{"$f":"IF(ISERROR(VLOOKUP(C14,Parameters!$F:$G,2,0)),\"-\",VLOOKUP(C14,Parameters!$F:$G,2,0))","v":"06B"},{"$f":"IF($A14=\"-\",\"-\",IF((COUNTIF($A$13:$A14,$A14)-1)<10,$A14&\"-0\"&(COUNTIF($A$13:$A14,$A14)-1),$A14&\"-\"&(COUNTIF($A$13:$A14,$A14)-1)))","v":"06B-00"},"2nd Assistant Director",null,null,null,null,null,null,{"$f":"ROUND(F14*G14,2)","v":0},null,{"$f":"ROUND(IF(H14=\"Yes\",J14*13.8%,0),2)","v":0},null,{"$f":"J14+L14","v":0},{"$f":"IF(N14=0,0,1)","v":0}]
[{"$f":"IF(ISERROR(VLOOKUP(C15,Parameters!$F:$G,2,0)),\"-\",VLOOKUP(C15,Parameters!$F:$G,2,0))","v":"06C"},{"$f":"IF($A15=\"-\",\"-\",IF((COUNTIF($A$13:$A15,$A15)-1)<10,$A15&\"-0\"&(COUNTIF($A$13:$A15,$A15)-1),$A15&\"-\"&(COUNTIF($A$13:$A15,$A15)-1)))","v":"06C-00"},"3rd Assistant Director",null,null,null,null,null,null,{"$f":"ROUND(F15*G15,2)","v":0},null,{"$f":"ROUND(IF(H15=\"Yes\",J15*13.8%,0),2)","v":0},null,{"$f":"J15+L15","v":0},0]
[{"$f":"IF(ISERROR(VLOOKUP(C16,Parameters!$F:$G,2,0)),\"-\",VLOOKUP(C16,Parameters!$F:$G,2,0))","v":"06D"},{"$f":"IF($A16=\"-\",\"-\",IF((COUNTIF($A$13:$A16,$A16)-1)<10,$A16&\"-0\"&(COUNTIF($A$13:$A16,$A16)-1),$A16&\"-\"&(COUNTIF($A$13:$A16,$A16)-1)))","v":"06D-00"},"Floor Manager",null,null,null,null,null,null,0,null,0,null,0,0]
[{"$f":"IF(ISERROR(VLOOKUP(C17,Parameters!$F:$G,2,0)),\"-\",VLOOKUP(C17,Parameters!$F:$G,2,0))","v":"06E"},{"$f":"IF($A17=\"-\",\"-\",IF((COUNTIF($A$13:$A17,$A17)-1)<10,$A17&\"-0\"&(COUNTIF($A$13:$A17,$A17)-1),$A17&\"-\"&(COUNTIF($A$13:$A17,$A17)-1)))","v":"06E-00"},"Assistant Floor Manager",null,null,null,null,null,null,0,null,0,null,0,0]
[{"$f":"IF(ISERROR(VLOOKUP(C18,Parameters!$F:$G,2,0)),\"-\",VLOOKUP(C18,Parameters!$F:$G,2,0))","v":"06F"},{"$f":"IF($A18=\"-\",\"-\",IF((COUNTIF($A$13:$A18,$A18)-1)<10,$A18&\"-0\"&(COUNTIF($A$13:$A18,$A18)-1),$A18&\"-\"&(COUNTIF($A$13:$A18,$A18)-1)))","v":"06F-00"},"Location / Production Runner",null,null,null,null,null,null,0,null,0,null,0,0]
[{"$f":"IF(ISERROR(VLOOKUP(C19,Parameters!$F:$G,2,0)),\"-\",VLOOKUP(C19,Parameters!$F:$G,2,0))","v":"06G"},{"$f":"IF($A19=\"-\",\"-\",IF((COUNTIF($A$13:$A19,$A19)-1)<10,$A19&\"-0\"&(COUNTIF($A$13:$A19,$A19)-1),$A19&\"-\"&(COUNTIF($A$13:$A19,$A19)-1)))","v":"06G-00"},"Continuity / Script Supervisor",null,null,null,null,null,null,0,null,0,null,0,0]
[{"$f":"A12&\" TOTAL\"","v":"06 - TOTAL"},null,null,null,null,null,null,null,null,{"$f":"SUM(J12:J19)","v":0},null,{"$f":"SUM(L12:L19)","v":0},null,{"$f":"SUM(N12:N19)","v":0},{"$f":"IF(N20=0,0,1)","v":0}]
{"$rows_left_out":133}
{"sheet":"Comparison","index":5,"n_rows":45,"n_cols":12,"rows_kept":45,"cut":false,"hidden":false,"merged":[[9,2,9,3],[10,2,10,3],[1,3,1,7],[2,3,2,7],[5,3,5,9],[6,3,6,9],[8,2,8,3],[8,4,8,5],[29,2,29,3],[30,2,30,3],[31,2,31,3],[12,2,12,3],[13,2,13,3],[26,2,26,3],[27,2,27,3],[16,2,16,3],[17,2,17,3],[18,2,18,3],[19,2,19,3],[20,2,20,3],[21,2,21,3],[14,2,14,3],[15,2,15,3],[22,2,22,3],[23,2,23,3],[24,2,24,3],[25,2,25,3],[28,2,28,3],[32,2,32,3],[33,2,33,3],[42,2,42,3],[43,2,43,3],[36,2,36,3],[37,2,37,3],[40,2,40,3],[41,2,41,3],[38,2,38,3],[39,2,39,3],[34,2,34,3],[35,2,35,3]]}
[]
[null,null,null,{"$f":"Totals!E3","v":"ITV STUDIOS"},null,null,null,null,null,null,null,"Back to Totals Page"]
[null,null,null,{"$f":"Totals!E4","v":"FACTUAL / ENTERTAINMENT"}]
[]
[]
[null,null,"Programme Name:",{"$f":"Name","v":0}]
[null,null,"Programme Number:",{"$f":"Number","v":0}]
[]
[null,null,null,null,"Current Budget",null,null,"Prior Year",null,"Variance"]
[null,"Code","Categories",null,"Episode","Series",null,"Budget",null,"increase/decrease",null,"Notes"]
[null,null,null,null,{"$f":"Currency","v":"£"},{"$f":"Currency","v":"£"},null,{"$f":"Currency","v":"£"},null,{"$f":"Currency","v":"£"}]
[]
[null,{"$f":"Totals!C18","v":"01"},{"$f":"Totals!D18","v":"Scripts/ Formats/Development"},null,{"$f":"Totals!F18","v":0},{"$f":"Totals!G18","v":0},null,null,null,{"$f":"H13-F13","v":0}]
[null,{"$f":"Totals!C19","v":"02"},{"$f":"Totals!D19","v":"Producer/Director"},null,{"$f":"Totals!F19","v":0},{"$f":"Totals!G19","v":0},null,null,null,{"$f":"H14-F14","v":0}]
[null,{"$f":"Totals!C20","v":"03"},{"$f":"Totals!D20","v":"Artists"},null,{"$f":"Totals!F20","v":0},{"$f":"Totals!G20","v":0},null,null,null,0]
[null,{"$f":"Totals!C21","v":"04"},{"$f":"Totals!D21","v":"Presenters/Interviewees/Contributors"},null,{"$f":"Totals!F21","v":0},{"$f":"Totals!G21","v":0},null,null,null,0]
[null,{"$f":"Totals!C22","v":"05"},{"$f":"Totals!D22","v":"Production Unit Salaries"},null,{"$f":"Totals!F22","v":0},{"$f":"Totals!G22","v":0},null,null,null,0]
[null,{"$f":"Totals!C23","v":"06"},{"$f":"Totals!D23","v":"Assistant Directors/Continuity"},null,{"$f":"Totals!F23","v":0},{"$f":"Totals!G23","v":0},null,null,null,0]
[null,{"$f":"Totals!C24","v":"07"},{"$f":"Totals!D24","v":"Crew - Camera"},null,{"$f":"Totals!F24","v":0},{"$f":"Totals!G24","v":0},null,null,null,0]
[null,{"$f":"Totals!C25","v":"08"},{"$f":"Totals!D25","v":"Crew - Sound"},null,{"$f":"Totals!F25","v":0},{"$f":"Totals!G25","v":0},null,null,null,0]
{"$rows_left_out":26}
{"sheet":"Schedule","index":6,"n_rows":39,"n_cols":36,"rows_kept":39,"cut":false,"hidden":false,"merged":[[1,0,1,2]]}
[{"$f":"Totals!E3","v":"ITV STUDIOS"}]
[{"$f":"Totals!E4","v":"FACTUAL / ENTERTAINMENT"}]
["Back to Totals Sheet"]
[{"$f":"Name","v":0}]
[{"$f":"Number","v":0}]
[]
["Budget Production Schedule"]
[]
["Weeks (calendar)",1,{"$f":"B9+1","v":2},{"$f":"C9+1","v":3},4,5,6,7,8,9,1,2,3,4,5,6,7,8,9,10,11,12,13,14,15,{"$f":"Y9+1","v":16},17,18,19,20,21,22,23,24,25,26]
["Date"]
["Pre Production"]
["Shoot"]
["View"]
["Offline "]
["Final Post"]
["Delivery"]
[]
[]
[]
[]
{"$rows_left_out":20}
{"sheet":"Assumptions","index":7,"n_rows":6,"n_cols":1,"rows_kept":6,"cut":false,"hidden":false,"merged":[]}
[{"$f":"Name","v":0}]
[{"$f":"Number","v":0}]
[]
["Back to Totals Page"]
[]
["Assumption Details:"]

{"sheet":"Parameters","index":8,"n_rows":407,"n_cols":7,"rows_kept":407,"cut":false,"hidden":true,"merged":[]}
[]
[null,null,null,null,"01A","Writers Fees",{"$f":"E2","v":"01A"}]
[null,null,null,null,"01B","Writers Repeat Fees",{"$f":"E3","v":"01B"}]
[null,null,null,null,"01C","Writers Pension","01C"]
["02A","Executive Producer","02A",null,"01D","Scripts Team","01D"]
["02B","Series Producer","02B",null,"01E","Consultancy - Scripts","01E"]
["02C","Producer","02C",null,"01F","Rights / Format Fees","01F"]
["02D","Assistant Producers","02D",null,"01G","Uncommissioned Writers","01G"]
["02E","Producer/Director","02E",null,"01H","Options","01H"]
["02F","Director","02F",null,"01I","Development Costs","01I"]
["02G","Series Editor","02G",null,"01J","Storyboards","01J"]
["02H","Deputy Editor","02H",null,"01K","Create Advance Payment","01K"]
[null,null,null,null,"02A","Executive Producer","02A"]
["05A","Associate Producer","05A",null,"02B","Series Producer","02B"]
["05B","Line Producer","05B",null,"02C","Producer","02C"]
["05C","Production Manager","05C",null,"02D","Assistant Producer","02D"]
["05D","Location Manager","05D",null,"02E","Producer / Director","02E"]
["05E","Assistant Location Manager","05E",null,"02F","Director","02F"]
["05F","Unit Manager","05F",null,"02G","Series Editor","02G"]
["05G","Unit Assistant","05G",null,"02H","Deputy Editor","02H"]
{"$rows_left_out":387}